problems compiling snapapi

Discussion in 'Acronis True Image Product Line' started by ArcticLord, Dec 19, 2006.

Thread Status:
Not open for further replies.
  1. ArcticLord

    ArcticLord Registered Member

    Joined:
    Nov 28, 2006
    Posts:
    2
    hi,

    i've problems compiling the snapapi26 module. I try version 0.7.4 and 0.7.10 but I always get
    Code:
    /var/lib/dkms/snapapi26/0.7.10/build/snapapi26.c:614: error: void value not igno
    red as it ought to be
    make[1]: *** [/var/lib/dkms/snapapi26/0.7.10/build/snapapi26.o] Error 1
    make: *** [_module_/var/lib/dkms/snapapi26/0.7.10/build] Error 2
    make: Leaving directory `/usr/src/linux-2.6.19.1'
    
    in my make.log when i try to compile with
    Code:
    dkms build -m snapapi26 -v 0.7.10 -d Debian --arch i686 --kernelsourcedir /usr/src/linux
    
    I'm using Debian 3.1 Sarge with a self compiled 2.6.19 kernel

    thx 4 answers
     
Thread Status:
Not open for further replies.