True Image Server for Linux, Help is Needed...

Discussion in 'Acronis True Image Product Line' started by timebandit, Jan 21, 2006.

Thread Status:
Not open for further replies.
  1. timebandit

    timebandit Guest

    Hi

    I've just upgraded from kernel 2.4.30 to 2.6.15 and was trying out Acronis True Image Server 8.0 Build 985 trial version but now i can't use it any more so i downloaded Build 989 and tried but get's the same errors...

    I am running Debian Sarge with Kernel 2.6.15...

    Running the ./trueimage-setup gives me ALOT of problem so i tried --NORPM like last time but now i get error with snapapi26 at the end of the installation...
    Error log from /var/lib/dkms/snapapi26/0.6.7/build/make.log ->>>

    DKMS make.log for snapapi26-0.6.7 for kernel 2.6.15 (i686)
    Sat Jan 21 23:06:19 CET 2006
    make: Entering directory `/usr/src/kernel-2.6.15'
    CC [M] /var/lib/dkms/snapapi26/0.6.7/build/snapapi26.o
    /var/lib/dkms/snapapi26/0.6.7/build/snapapi26.c: In function `sa_cache_bio_end_io':
    /var/lib/dkms/snapapi26/0.6.7/build/snapapi26.c:957: warning: long long unsigned int format, different type arg (arg 5)
    /var/lib/dkms/snapapi26/0.6.7/build/snapapi26.c: In function `session_devinfo':
    /var/lib/dkms/snapapi26/0.6.7/build/snapapi26.c:1399: error: structure has no member named `reads'
    /var/lib/dkms/snapapi26/0.6.7/build/snapapi26.c:1400: error: structure has no member named `read_sectors'
    /var/lib/dkms/snapapi26/0.6.7/build/snapapi26.c:1401: error: structure has no member named `writes'
    /var/lib/dkms/snapapi26/0.6.7/build/snapapi26.c:1402: error: structure has no member named `write_sectors'
    /var/lib/dkms/snapapi26/0.6.7/build/snapapi26.c:1405: error: structure has no member named `reads'
    /var/lib/dkms/snapapi26/0.6.7/build/snapapi26.c:1405: warning: type defaults to `int' in declaration of `res'
    /var/lib/dkms/snapapi26/0.6.7/build/snapapi26.c:1405: error: structure has no member named `reads'
    /var/lib/dkms/snapapi26/0.6.7/build/snapapi26.c:1406: error: structure has no member named `read_sectors'
    /var/lib/dkms/snapapi26/0.6.7/build/snapapi26.c:1406: warning: type defaults to `int' in declaration of `res'
    /var/lib/dkms/snapapi26/0.6.7/build/snapapi26.c:1406: error: structure has no member named `read_sectors'
    /var/lib/dkms/snapapi26/0.6.7/build/snapapi26.c:1407: error: structure has no member named `writes'
    /var/lib/dkms/snapapi26/0.6.7/build/snapapi26.c:1407: warning: type defaults to `int' in declaration of `res'
    /var/lib/dkms/snapapi26/0.6.7/build/snapapi26.c:1407: error: structure has no member named `writes'
    /var/lib/dkms/snapapi26/0.6.7/build/snapapi26.c:1408: error: structure has no member named `write_sectors'
    /var/lib/dkms/snapapi26/0.6.7/build/snapapi26.c:1408: warning: type defaults to `int' in declaration of `res'
    /var/lib/dkms/snapapi26/0.6.7/build/snapapi26.c:1408: error: structure has no member named `write_sectors'
    make[1]: *** [/var/lib/dkms/snapapi26/0.6.7/build/snapapi26.o] Error 1
    make: *** [_module_/var/lib/dkms/snapapi26/0.6.7/build] Error 2
    make: Leaving directory `/usr/src/kernel-2.6.15'


    Error log from /var/log/trueimage-setup.log ->>>>

    RPM DB opened
    checkPackages: adding buf=/home/timebandit/Acronis/trueimagelinuxserver8.0-989.d.e/RPMS/trueimage-static-8.0-989.d.e.i386.rpm
    checkPackages: adding buf=/home/timebandit/Acronis/trueimagelinuxserver8.0-989.d.e/RPMS/trueimage-8.0-989.d.e.i386.rpm
    checkPackages: adding buf=/home/timebandit/Acronis/trueimagelinuxserver8.0-989.d.e/RPMS/snapapi26-modules-0.6.7-1.noarch.rpm
    checkPackages: adding buf=/home/timebandit/Acronis/trueimagelinuxserver8.0-989.d.e/RPMS/snapapi-modules-0.6.4-1.noarch.rpm
    checkPackages: adding buf=/home/timebandit/Acronis/trueimagelinuxserver8.0-989.d.e/RPMS/dkms-2.0.4.2-1.acronis.noarch.rpm
    kernel 2.6.15 detected - module name snapapi26
    CPIO: checkDeps
    CPIO: run
    RPM DB closed
    Launching '/usr/sbin/dkms install -m snapapi26 -v 0.6.7 2>&1'

    Error! Could not locate snapapi26.ko for module snapapi26 in the DKMS tree.
    You must run a dkms build for kernel 2.6.15 (i686) first.

    Preparing kernel 2.6.15 for module build:
    (This is not compiling a kernel, only just preparing kernel symbols)
    Storing current .config to be restored when complete
    using presented .config
    make oldconfig....
    make prepare-all....

    Building module:
    cleaning build area....
    make KERNELRELEASE=2.6.15 -C /lib/modules/2.6.15/build SUBDIRS=/var/lib/dkms/snapapi26/0.6.7/build modules....(bad exit status: 2)

    Error! Bad return status for module build on kernel: 2.6.15 (i686)
    Consult the make.log in the build directory
    /var/lib/dkms/snapapi26/0.6.7/build/ for more information.
    exited with status 10
     
  2. Acronis Support

    Acronis Support Acronis Support Staff

    Joined:
    Apr 28, 2004
    Posts:
    25,885
Thread Status:
Not open for further replies.