Linux kernel 2.6.26 support?

Discussion in 'Acronis True Image Product Line' started by 99problems, Oct 28, 2008.

Thread Status:
Not open for further replies.
  1. 99problems

    99problems Registered Member

    Joined:
    Jun 2, 2006
    Posts:
    7
    Acronis Support - when will kernel vesion 2.6.26 be supported out of the box? I am using snapapi version 0.7.29. The following errors occur:

    make: Entering directory `/usr/src/kernels/2.6.26.6-49.fc8-i686'
    CC [M] /var/lib/dkms/snapapi26/0.7.29/build/snapapi26.o
    /var/lib/dkms/snapapi26/0.7.29/build/snapapi26.c:607:34: error: macro "bio_io_error" passed 2 arguments, but takes just 1
    /var/lib/dkms/snapapi26/0.7.29/build/snapapi26.c: In function ‘make_original_request’:
    /var/lib/dkms/snapapi26/0.7.29/build/snapapi26.c:607: error: ‘bio_io_error’ undeclared (first use in this function)
    /var/lib/dkms/snapapi26/0.7.29/build/snapapi26.c:607: error: (Each undeclared identifier is reported only once
    /var/lib/dkms/snapapi26/0.7.29/build/snapapi26.c:607: error: for each function it appears in.)
    /var/lib/dkms/snapapi26/0.7.29/build/snapapi26.c: In function ‘submit_pending_request’:
    /var/lib/dkms/snapapi26/0.7.29/build/snapapi26.c:1193: warning: assignment from incompatible pointer type
    /var/lib/dkms/snapapi26/0.7.29/build/snapapi26.c: In function ‘sa_cache_block’:
    /var/lib/dkms/snapapi26/0.7.29/build/snapapi26.c:1289: warning: assignment from incompatible pointer type
    /var/lib/dkms/snapapi26/0.7.29/build/snapapi26.c: In function ‘snapapi_make_request’:
    /var/lib/dkms/snapapi26/0.7.29/build/snapapi26.c:1528: error: too many arguments to function ‘bio_endio’
    /var/lib/dkms/snapapi26/0.7.29/build/snapapi26.c: In function ‘session_devinfo’:
    /var/lib/dkms/snapapi26/0.7.29/build/snapapi26.c:1870: error: ‘struct hd_struct’ has no member named ‘ios’
    /var/lib/dkms/snapapi26/0.7.29/build/snapapi26.c:1871: error: ‘struct hd_struct’ has no member named ‘sectors’
    /var/lib/dkms/snapapi26/0.7.29/build/snapapi26.c:1872: error: ‘struct hd_struct’ has no member named ‘ios’
    /var/lib/dkms/snapapi26/0.7.29/build/snapapi26.c:1873: error: ‘struct hd_struct’ has no member named ‘sectors’
    /var/lib/dkms/snapapi26/0.7.29/build/snapapi26.c: In function ‘bread_submit_bios’:
    /var/lib/dkms/snapapi26/0.7.29/build/snapapi26.c:2034: warning: assignment from incompatible pointer type
    /var/lib/dkms/snapapi26/0.7.29/build/snapapi26.c: In function ‘snapapi_vm_nopage’:
    /var/lib/dkms/snapapi26/0.7.29/build/snapapi26.c:2981: error: ‘NOPAGE_SIGBUS’ undeclared (first use in this function)
    /var/lib/dkms/snapapi26/0.7.29/build/snapapi26.c: At top level:
    /var/lib/dkms/snapapi26/0.7.29/build/snapapi26.c:3222: error: unknown field ‘nopage’ specified in initializer
    /var/lib/dkms/snapapi26/0.7.29/build/snapapi26.c:3222: warning: initialization from incompatible pointer type
    make[1]: *** [/var/lib/dkms/snapapi26/0.7.29/build/snapapi26.o] Error 1
    make: *** [_module_/var/lib/dkms/snapapi26/0.7.29/build] Error 2
    make: Leaving directory `/usr/src/kernels/2.6.26.6-49.fc8-i686'

    Thank you!
     
  2. 99problems

    99problems Registered Member

    Joined:
    Jun 2, 2006
    Posts:
    7
    Can't I get a download link for the latest snapapi rpm? I think that will fix the problem.

    Thanks
     
  3. Acronis Support

    Acronis Support Acronis Support Staff

    Joined:
    Apr 28, 2004
    Posts:
    25,885
    Hello 99problems,

    Thank you for using Acronis Corporate Products

    This kernel is not supported. To resolve the issue please download and install SnapAPI program that is available at the private messages. This link is valid for 14 days and you are able to download the file 5 times.

    Thank you.

    __

    Oleg Lee
     
Thread Status:
Not open for further replies.