error by the installing snapapi on SUSE 10.0 Enterprise server

Discussion in 'Acronis True Image Product Line' started by Hierax, Mar 2, 2008.

Thread Status:
Not open for further replies.
  1. Hierax

    Hierax Registered Member

    Mar 2, 2008
    I am installed Acronis Echo Server on SUSE 10.0 Enterprise Server a module called snapapi has to be compiled and inserted. The installer fails at the job, and following the instructions for manually doing it, I get more errors. Here's the make log of the process:

    DKMS make.log for snapapi26-0.7.28 for kernel (x86_64)
    Sun Mar 2 10:24:58 CET 2008
    make: Entering directory `/usr/src/linux-'
    make -C /usr/src/linux- O=/usr/src/linux- modules

    WARNING: Symbol version dump /usr/src/linux-
    is missing; modules will have no dependencies and modversions.

    find: /linux: No such file or directory
    find: /linux: No such file or directory
    CC [M] /var/lib/dkms/snapapi26/0.7.28/build/snapapi26.o
    /var/lib/dkms/snapapi26/0.7.28/build/snapapi26.c:313: warning: ÔÇśdump_sessionsÔÇÖ declared ÔÇśstaticÔÇÖ but never defined
    /var/lib/dkms/snapapi26/0.7.28/build/snapapi26.c:1104: warning: ÔÇśprint_bioÔÇÖ defined but not used
    CC [M] /var/lib/dkms/snapapi26/0.7.28/build/snumbd26.o
    /var/lib/dkms/snapapi26/0.7.28/build/snumbd26.c: In function ÔÇśsnumbd_make_requestÔÇÖ:
    /var/lib/dkms/snapapi26/0.7.28/build/snumbd26.c:647: warning: label ÔÇśout_upÔÇÖ defined but not used
    Building modules, stage 2.
    /bin/sh: scripts/mod/modpost: No such file or directory
    make[3]: *** [__modpost] Error 127
    make[2]: *** [modules] Error 2
    make[1]: *** [modules] Error 2
    make: *** [modules] Error 2
    make: Leaving directory `/usr/src/linux-'
  2. Acronis Support

    Acronis Support Acronis Support Staff

    Apr 28, 2004
    Hello Hierax,

    Thank you for using Acronis Server Disk Backup software

    Please note that we've released the new build and it's recommend to download it first. Regarding the issues with snapapi module - could you please use path


    as source (without "-obj" part)

    Thank you.
    Michael Levchenko
Thread Status:
Not open for further replies.
  1. This site uses cookies to help personalise content, tailor your experience and to keep you logged in if you register.
    By continuing to use this site, you are consenting to our use of cookies.