TrueImageServer9.1 on Debian Sarge 2.6.8-3-686

Discussion in 'Acronis True Image Product Line' started by, Dec 30, 2006.

Thread Status:
Not open for further replies.
  1. Registered Member

    Dec 30, 2006

    I have in the last day's tried to compile snapapi26 for a Debian linuxbox running kernel 2.6.8-3-686

    I'm using the demo version of Trueimageserver 9.1 for Linux to test the product before I buy it, like to know how it works before spending 999 bucks on it.

    Im installing by running ./Trueimageserver9.1_d_en.i686
    Someplace into the installation I get a error saying that i should install the snapapi manuel and this is what i have tried until now.

    Linuxbox:/usr/src/#dkms build -m snapapi26 -v 0.7.10 --config=/boot/config-2.6.8-3-686 --kernelsourcedir=/usr/src/kernel-source-2.6.8 -c /usr/src/snapapi26-0.7.10/dkms.conf -k 2.6.8-3-686 --arch i686

    Preparing kernel 2.6.8-3-686 for module build:
    (This is not compiling a kernel, only just preparing kernel symbols)
    Storing current .config to be restored when complete
    Running Generic preparation routine
    make mrproper....
    using /boot/config-2.6.8-3-686
    make oldconfig.....
    make prepare-all.....

    Building module:
    cleaning build area....
    make KERNELRELEASE=2.6.8-3-686 -C /usr/src/kernel-source-2.6.8 SUBDIRS=/var/lib/dkms/snapapi26/0.7.10/build modules....(bad exit status: 2)

    Error! Bad return status for module build on kernel: 2.6.8-3-686 (i686)
    Consult the make.log in the build directory
    /var/lib/dkms/snapapi26/0.7.10/build/ for more information.

    When i look in the make.log file
    linuxbox:/usr/src#cat /var/lib/dkms/snapapi26/0.7.10/build/make.log
    DKMS make.log for snapapi26-0.7.10 for kernel 2.6.8-3-686 (i686)
    Sat Dec 30 16:04:44 CET 2006
    make: Entering directory `/usr/src/kernel-source-2.6.8'
    find: /linux: No such file or directory
    CC [M] /var/lib/dkms/snapapi26/0.7.10/build/snapapi26.o
    /var/lib/dkms/snapapi26/0.7.10/build/snapapi26.c: In function `do_init_session':
    /var/lib/dkms/snapapi26/0.7.10/build/snapapi26.c:1970: error: structure has no member named `max_hw_sectors'
    make[1]: *** [/var/lib/dkms/snapapi26/0.7.10/build/snapapi26.o] Error 1
    make: *** [_module_/var/lib/dkms/snapapi26/0.7.10/build] Error 2
    make: Leaving directory `/usr/src/kernel-source-2.6.8'

    gcc --version
    gcc (GCC) 3.3.5 (Debian 1:3.3.5-13)

    uname -r

    I have kernelsource and headers installed.

    Please help
  2. Acronis Support

    Acronis Support Acronis Support Staff

    Apr 28, 2004

    Thank you for your interest in Acronis Linux Server Disk Backup Software.

    We are sorry for the delayed response.

    Please be aware that this issue is known already. Please submit a request for technical support with the subject indicating that you want to contact Anton Sherkhonov . Attach the link to this thread. He will provide you with a solution.

    Thank you.
    Aleksandr Isakov
Thread Status:
Not open for further replies.